Natural Language Generation
type: Named individual
type: Operation
type: Concept
narrower: Summarization

Natural Language Generation Collection
type: Named individual
type: Operation
type: Collection
member: Summarization

Operation
type: Class

Operation Taxonomy
type: Named individual
type: ConceptScheme

Summarization
type: Concept
type: Operation
type: Named individual
comment: The process/task of reducing one or more textual documents with a computer program in order to create a summary that retains the most important points of the original document(s)
label: Summarisation
alternative label: Text Summarization
alternative label: Automatic Text Summarization
alternative label: Text Summarisation
alternative label: Automatic Text Summarisation
alternative label: Automatic Summarization
alternative label: TS
alternative label: ATS
alternative label: Automatic Summarisation
broader: Natural Language Generation
definition: Text summarization is the process of distilling the most important information from a source (or sources) to produce an abridged version for a particular user (or users) and task (or tasks). Source: Mani, I. and Maybury, M. T., editors (1999), Advances in Automatic Text Summarization. MIT Press, Cambridge, Massachusetts.
in scheme: Operation Taxonomy

Text Processing Collection
type: Named individual
type: Operation
type: Collection
member: Summarization

Named individual
type: Class