Translation Technologies Collection
type: Named individual
type: Operation
type: Collection
member: Computer-aided translation

Computer-aided translation
type: Concept
alternative label: MAHT
alternative label: Computer-assisted translation
alternative label: Machine-aided human translation
alternative label: CAT
comment: A form of translation performed by a human translator with the aid of software programmes
definition: Techniques that help to increase the productivity of human translators via suitable computational infrastructure, including translation memories, terminology management, partial machine translation, online lexicons, or other techniques that automate parts of the translator's work, such as speech recognition or accelerated typing techniques applied to human translations.
type: Named individual
type: Operation
broader: Machine Translation
in scheme: Operation Taxonomy

Machine Translation
type: Named individual
type: Operation
type: Concept

Operation Taxonomy
type: Named individual
type: ConceptScheme

Operation
type: Class

Named individual
type: Class