Information Extraction
type: Named individual
type: Operation
type: Concept
narrower: Hate speech recognition

Named individual
type: Class

Operation
type: Class

Information Extraction and Information Retrieval Collection
type: Named individual
type: Operation
type: Collection
member: Hate speech recognition

Hate speech recognition
type: Concept
comment: The task of automatically identifying hate speech, i.e. statements intended to demean and brutalise another, or the use of cruel and derogatory language on the basis of real or alleged membership in a social group [adapted from wikipedia]
comment: The task of automatically identifying hate speech, i.e. statements intended to demean and brutalize another, or the use of cruel and derogatory language on the basis of real or alleged membership in a social group [adapted from wikipedia]
in scheme: Operation Taxonomy
type: Operation
type: Named individual
alternative label: Hate speech detection
broader: Information Extraction

Operation Taxonomy
type: Named individual
type: ConceptScheme