Question Answering
type: Named individual
type: Operation
type: Concept
broader: Knowledge Discovery

Text and Data Mining
type: Named individual
type: Operation
type: Concept
narrower: Knowledge Discovery

Named individual
type: Class

Operation
type: Class

Knowledge Discovery
type: Concept
type: Operation
type: Named individual
definition: Generally, knowledge discovery / data mining is the process of analyzing data from different perspectives and summarizing it into useful information - information that can be used to increase revenue, cuts costs, or both. Data mining software is one of a number of analytical tools for analyzing data. It allows users to analyze data from many different dimensions or angles, categorize it, and summarize the relationships identified. Technically, data mining is the process of finding correlations or patterns among dozens of fields in large relational databases.
definition: Generally, knowledge discovery / data mining is the process of analyzing data from different perspectives and summarising it into useful information - information that can be used to increase revenue, cuts costs, or both. Data mining software is one of a number of analytical tools for analysing data. It allows users to analyse data from many different dimensions or angles, categorise it, and summarise the relationships identified. Technically, data mining is the process of finding correlations or patterns among dozens of fields in large relational databases.
alternative label: KD
alternative label: Knowledge Discovery in Databases
alternative label: KDD
narrower: Question Answering
narrower: Recognizing Textual Entailment
comment: The task/process of automatically searching large volumes of data for patterns that can be considered knowledge about the data
in scheme: Operation Taxonomy
broader: Text and Data Mining

Recognizing Textual Entailment
type: Named individual
label: Recognising Textual Entailment
type: Operation
type: Concept
broader: Knowledge Discovery

Operation Taxonomy
type: Named individual
type: ConceptScheme

Information Extraction and Information Retrieval Collection
type: Named individual
type: Operation
type: Collection
member: Knowledge Discovery