Semantic annotation
type: Named individual
type: Operation
type: Concept
narrower: Frame-semantic parsing

Frame-semantic parsing
in scheme: Operation Taxonomy
comment: The task/process of recognising and labelling in a text predicate argument structures and the semantic roles of the constituents, in accordance to the frame semantics theory
comment: The task/process of recognising and labeling in a text predicate argument structures and the semantic roles of the constituents, in accordance to the frame semantics theory
type: Concept
type: Operation
type: Named individual
broader: Semantic annotation
broader: Parsing

Parsing
type: Named individual
type: Operation
type: Concept
narrower: Frame-semantic parsing

Named individual
type: Class

Operation
type: Class

Text Processing Collection
type: Named individual
type: Operation
type: Collection
member: Frame-semantic parsing

Operation Taxonomy
type: Named individual
type: ConceptScheme