Authoring support
type: Named individual
type: Operation
type: Concept
narrower: Language checking

Named individual
type: Class

Operation
type: Class

Text Processing Collection
type: Named individual
type: Operation
type: Collection
member: Language checking

Operation Taxonomy
type: Named individual
type: ConceptScheme

Language checking
alternative label: Proofing
in scheme: Operation Taxonomy
type: Operation
type: Concept
type: Named individual
comment: The task/process of identifying (and usually correcting) grammatical mistakes in a text
comment: Language Checking comprises technologies used to detect and/or correct erroneous or inconsistent language use in documents. The scope of language checking technology ranges from general error correction, as performed by spell checkers and grammar checkers
broader: Authoring support