Named individual
type: Class

Morphological analysis
alternative label: General morphological analyisis
broader: Linguistic analysis
definition: The technologies for or the process of tracing the inflectional, derivational, and compounding processes in the formation of a given word in order to determine properties such as stem form, part-of-speech and inflectional information. As a crucial preprocessing step, morphological analysis is used in virtually all fields of natural language processing.
type: Operation
type: Named individual
type: Concept
comment: The analysis of the structure of words and their relations to other words as regards their form and derivation
in scheme: Operation Taxonomy

Operation
type: Class

Linguistic analysis
type: Named individual
type: Operation
type: Concept
narrower: Morphological analysis

Text Processing Collection
type: Named individual
type: Operation
type: Collection
member: Morphological analysis

Operation Taxonomy
type: Named individual
type: ConceptScheme