Speech Recognition
type: Named individual
type: Operation
type: Concept
narrower: Speech Enhancement

Named individual
type: Class

Operation
type: Class

Speech Processing Collection
type: Named individual
type: Operation
type: Collection
member: Speech Enhancement

Speech Enhancement
comment: The improvement of speech intelligibility by removing background noise from the speech signal
definition: The improvement of speech intelligibility by removing background noise from the speech signal. Due to the complexity of speech acoustics and perception, no simple mathematical error criterion can be applied; instead, algorithms and measures need to be developed which accomodate human perception.
in scheme: Operation Taxonomy
broader: Speech Recognition
type: Named individual
type: Operation
type: Concept

Operation Taxonomy
type: Named individual
type: ConceptScheme