Authoring support
type: Named individual
type: Operation
type: Concept
narrower: Spell checking

Named individual
type: Class

Operation
type: Class

Text Processing Collection
type: Named individual
type: Operation
type: Collection
member: Spell checking

Operation Taxonomy
type: Named individual
type: ConceptScheme

Spell checking
comment: The task/process of checking the accuracy of spelling of a word (and usually correcting it) according to the accepted form
comment: Techniques for the identification of spelling or typing errors in textual documents, which may be applied interactively during the creation of the document, or off-line for existing documents. Spelling correction is an extension in which for each assumed error one or several hypothetical corrections are suggested.
in scheme: Operation Taxonomy
type: Operation
type: Concept
type: Named individual
broader: Authoring support
alternative label: Spelling correction